LV2 Port Properties
type: Ontology
comment: Various properties for LV2 plugin ports.

trigger
type: PortProperty
comment: Port is a momentary trigger.

supports strict bounds
type: Feature
comment: A feature indicating plugin support for strict port bounds.

has strict bounds
type: PortProperty
comment: Port has strict bounds which are not internally clamped.

changes are expensive
type: PortProperty
comment: Input port is expensive to change.

changes cause artifacts
type: PortProperty
comment: Input port causes audible artifacts when changed.

smooth modulation signal
type: PortProperty
comment: Port carries a smooth modulation signal.

discrete modulation signal
type: PortProperty
comment: Port carries a discrete modulation signal.

logarithmic
type: PortProperty
comment: Port value is logarithmic.

not automatic
type: PortProperty
comment: Port that is not intended to be fed with a modulation signal.

not on GUI
type: PortProperty
comment: Port that should not be displayed on a GUI.

display priority
type: Property
type: DatatypeProperty
domain: Port
range: nonNegativeInteger
comment: A priority ranking this port in importance to its plugin.

range steps
type: Property
type: DatatypeProperty
domain: Port
range: nonNegativeInteger
comment: The number of even steps the range should be divided into.