osc
type: Specification
license: mit
name: LV2 OSC Events
comment: Defines an LV2 event type for standard raw OSC
maintainer: David Robillard

Has a main OSC control port
type: Property
domain: Plugin
range: Port
comment: Specifies a port that can be used as the OSC interface for the plugin as a whole. For example, if a host is providing an OSC interface to a plugin at /some/osc/path/someplugin and a message /some/osc/path/someplugin/foo is received, the message /foo should be sent to this port.