LV2 Buf Size
type: Ontology
comment: Access to, and restrictions on, buffer sizes.

bounded block length
type: Feature
comment: Block length has lower and upper bounds.

fixed block length
type: Feature
comment: Block length never changes.

power of 2 block length
type: Feature
comment: Block length is a power of 2.

coarse block length
type: Feature
comment: Plugin prefers coarse block length without buffer splitting.

maximum block length
type: Property
type: DatatypeProperty
type: Option
comment: Block length has an upper bound.
range: nonNegativeInteger

minimum block length
type: Property
type: DatatypeProperty
type: Option
comment: Block length has a lower bound.
range: nonNegativeInteger

nominal block length
type: Property
type: DatatypeProperty
type: Option
comment: Typical block length that will most often be processed.
range: nonNegativeInteger

sequence size
type: Property
type: DatatypeProperty
type: Option
comment: The maximum size of a sequence, in bytes.
range: nonNegativeInteger