LV2 Event
type: Ontology
deprecated: true
comment: A port-based real-time generic event interface.

Event Port
type: Class
subclass of: Port
comment: An LV2 event port.

Event
type: Class
comment: A single generic time-stamped event.

Event Time Stamp
type: Class
comment: The time stamp of an Event.

Audio Frame Time Stamp
type: Class
subclass of: Event Time Stamp
comment: The default time stamp unit for an event.

generic event port
type: PortProperty
comment: Port works with generic events.

supports event type
type: Property
type: ObjectProperty
domain: Event Port
range: Class
comment: An event type supported by this port.

inherits event type
type: Property
type: ObjectProperty
domain: Event Port
domain: OutputPort
range: Port
comment: Output port inherits event types from an input port.

supports time stamp type
type: Property
type: ObjectProperty
domain: Event Port
domain: InputPort
range: Class
comment: A time stamp type suported by this input port.

generates time stamp type
type: Property
type: ObjectProperty
domain: Event Port
domain: OutputPort
range: Class
comment: A time stamp type generated by this input port.

inherits time stamp type
type: Property
type: ObjectProperty
domain: Event Port
domain: OutputPort
range: Port
comment: Output port inherits time stamp types from an input port.