LV2 Morph
type: Ontology
type: Specification
comment: Ports that can dynamically change type.

Morph Port
type: Class
subclass of: Port
comment: A port which can be switched to another type.

Auto Morph Port
type: Class
subclass of: Port
comment: A port that can change its type based on that of another.

supports type
type: Property
type: ObjectProperty
domain: Morph Port
comment: A type that a port supports being switched to.

current type
type: Property
type: Option
type: ObjectProperty
domain: Morph Port
comment: The currently active type of the port.