LV2 Morph
type: Ontology
comment: Ports that can dynamically change type.

Morph Port
type: Class
subclass of: Port
comment: A port which can be switched to another type.

Auto Morph Port
type: Class
subclass of: Port
comment: A port that can change its type based on that of another.

supports type
type: Property
type: ObjectProperty
domain: Morph Port
comment: A type that a port supports being switched to.

current type
type: Property
type: Option
type: ObjectProperty
domain: Morph Port
comment: The currently active type of the port.

a
type: /git/cgit.cgi/lv2.git/log/core.lv2/serd-0.1.0.c?h=v1.10.0
type: active
type: /git/cgit.cgi/lv2.git/stats/core.lv2/serd-0.1.0.c?h=v1.10.0
type: td
type: form
type: right
type: get
type: /git/cgit.cgi/lv2.git/log/core.lv2/serd-0.1.0.c
type: hidden
type: h
type: v1.10.0
type: id
type: qt
type: grep
type: option
type: author
type: committer
type: range
type: select
type: txt
type: search
type: 10
type: q
type: submit
type: tr
type: table
type: path
type: div
type: content
type: blob content
type: blob
type: linenumbers
type: pre
type: n1
type: #n1
type: 1
type: n2
type: #n2
type: 2
type: n3
type: #n3
type: 3
type: n4
type: #n4
type: 4
type: n5
type: #n5
type: 5
type: n6
type: #n6
type: 6
type: n7
type: #n7
type: 7
type: n8
type: #n8
type: 8
type: n9
type: #n9
type: 9
type: n10
type: #n10
type: n11
type: #n11
type: 11
type: n12
type: #n12
type: 12
type: n13
type: #n13
type: 13
type: n14
type: #n14
type: 14
type: n15
type: #n15
type: 15
type: n16
type: #n16
type: 16