LV2 Options
type: Ontology
type: Specification
comment: Runtime options for LV2 plugins and UIs.

Option
type: Class
subclass of: Property
comment: A value for a static option passed to an instance.

interface
type: ExtensionData
comment: An interface for dynamically setting and getting options.

options
type: Feature
comment: The feature used to provide options to an instance.

required option
type: Property
type: ObjectProperty
range: Property
comment: An option required by the instance to function at all.

supported option
type: Property
type: ObjectProperty
range: Property
comment: An option supported or by the instance.