LV2 Resize Port
type: Ontology
comment: Dynamically sized LV2 port buffers.
imports: lv2core

resize
type: Feature
comment: A feature for resizing output port buffers.

as large as
type: Property
type: DatatypeProperty
domain: Port
range: Symbol
comment: Port that this port must have at least as much buffer space as.

minimum size
type: Property
type: DatatypeProperty
type: FunctionalProperty
domain: Port
range: nonNegativeInteger
comment: Minimum buffer size required by a port, in bytes.