DOAP Change Sets
type: Ontology
created: 2010-01-08
issued: 2010-01-08
modified: 2010-01-08
modified: 2010-01-27
modified: 2011-02-15
creator: http://tobyinkster.co.uk/#i

Change Set
type: Class
comment: A collection of changes. Not necessarily disjoint with foaf:Document!
subclass of: Bag

To-Do List
type: Class
comment: A collection of planned changes.
subclass of: Class

Wish List
type: Class
comment: A collection of desired changes.
subclass of: Class

Change
type: Class
comment: A change to something. Use rdfs:label to briefly describe the change. Use rdfs:comment for additional information.

Addition
type: Class
comment: A change that added a new feature.
subclass of: Change

Addition
type: Class
comment: A change that removed a feature.
subclass of: Change

Bugfix
type: Class
comment: A change that fixed a problem with an existing feature.
subclass of: Change

Update
type: Class
comment: A change that brought a feature into compliance with policy or other changes in the external world.
subclass of: Change

Regression
type: Class
comment: A change that caused a problem with an existing feature.
subclass of: Change

Documentation Change
type: Class
subclass of: Change

Packaging Change
type: Class
subclass of: Change

Security Fix
type: Class
comment: A change that fixed or improved a security problem.
subclass of: Change

Security Regression
type: Class
comment: A change that created or worsened a security problem.
subclass of: Change
subclass of: Regression

change set
type: ObjectProperty
comment: A change set may be associated with a particular software version in which those changes were released; or with an event which caused those changes.
domain: Class
range: Change Set

versus
type: ObjectProperty
comment: The previous version or event which a changeset has changed from.
domain: Change Set
range: Class

item
type: ObjectProperty
comment: A change within a change set.
domain: Change Set
range: Change
sub property of: member

file
type: ObjectProperty
comment: A file involved in the change.
domain: Change

fixes
type: ObjectProperty
comment: A bug fixed by the change.
domain: Bugfix
range: Issue

implements
type: ObjectProperty
domain: Addition
range: Specification

restores
type: ObjectProperty
comment: An association between a regression and a later bugfix that fixes it.
domain: Bugfix
range: Regression

blame
type: ObjectProperty
domain: Change
range: Agent

checkin
type: DatatypeProperty
comment: The identifier used by the project's version control system that records when this change was made.
domain: Change
range: string

milestone
type: ObjectProperty
domain: Class
range: Class

tasks
type: ObjectProperty
domain: Agent
range: To-Do List

wishes
type: ObjectProperty
domain: Person
range: Wish List

requires
type: ObjectProperty
comment: Indicates that the subject Change cannot/could not be completed without the object Change.
domain: Change
range: Change

timescale
type: DatatypeProperty
comment: Human-readable description of the approximate time a change/feature should be complete by.
domain: Change
range: string

a
type: n113
type: #n113
type: 113
type: n114
type: #n114
type: 114
type: n115
type: #n115
type: 115
type: n116
type: #n116
type: 116
type: n117
type: #n117
type: 117
type: n118
type: #n118
type: 118
type: n119
type: #n119
type: 119
type: n120
type: #n120
type: 120
type: n121
type: #n121
type: 121
type: n122
type: #n122
type: 122
type: n123
type: #n123
type: 123
type: n124
type: #n124
type: 124
type: n125
type: #n125
type: 125
type: n126
type: #n126
type: 126
type: n127
type: #n127
type: 127
type: n128
type: #n128
type: 128
type: n129
type: #n129
type: 129
type: n130
type: #n130
type: 130
type: n131
type: #n131
type: 131
type: n132
type: #n132
type: 132
type: n133
type: #n133
type: 133
type: n134
type: #n134
type: 134
type: n135
type: #n135
type: 135
type: n136
type: #n136
type: 136
type: n137
type: #n137
type: 137
type: n138
type: #n138
type: 138
type: n139
type: #n139